{"text_format":"1","workbook":"xlsx","n_sheets":7,"sheets":["Instructions","ADM","Allow SF","Current Capacity","Projected Capacity","Current ADM","Historical ADM by Area"],"not_rendered":{"charts":0,"images":2,"macros":1,"external_links":2,"defined_names":194,"comments":4,"pivot_tables":0},"unopened":[],"bounds":{"document_bytes":16777216,"sheet_cells":100000,"rows_first":2000,"rows_last":500,"rows_between":2000,"halvings":0,"cell_chars":16384,"cell_head_chars":4096},"cells_cut":0,"cells_raw":0,"read":"whole","date_system":"1900"}

{"sheet":"Instructions","index":0,"n_rows":23,"n_cols":2,"rows_kept":23,"cut":false,"hidden":false,"merged":[]}
["Instructions for DEED Allowable Space Calculation Workbook"]
["This workbook uses macros, for full functionality ensure that macros are enabled."]
["TAB: ADM"]
[0,"The \"ADM\" tab is used to select the school name and school type for a proposed project that is adding or replacing space in a district attendance area.  Once the school is selected, the historical average daily membership (ADM) of the school's associated attendance area is displayed and an average annual ADM change is calculated. This percent change is used to forecast the school ADM to a date \"five-years post-occupancy\" of a proposed project. The projected ADM enrollment is the basis of the eligible/allowable gross square footage (GSF). \n\nAlternative ADM projection methods besides this straight-line method are available, and may be preferable in cases of small enrollment numbers.\n"]
[1,"Select the desired School name from the pull down menu in cell C7;"]
[2,"Select the School Type from the pull down menu in cell C9 \nDefinitions: \n\"Elementary\" schools with a combination of grades K through 6\n\"Secondary\" schools with a combination of grades 7 through 12\n\"Secondary+6\" schools with grades 6 through 8 or higher \n\"Mixed Grade\" schools with combination of elementary and secondary (typically K-8)\n\"K-12\" schools with all grades K through 12"]
[3,"If desired, enter the district’s student population projections in cells C13 to J13 (elementary K-6) and/or C14 to J14 (secondary 7-12)."]
[4,"For districts with more than one High School in an attendance area, the number of students in cells C13 and C14 must be entered manually from Columns C (K-6) and D (7-12) in the “Current ADM” worksheet, and the existing square footage entered on the “Allow SF” worksheet in cell B9 must include all square footage for the appropriate School Type in the attendance area.  \nFor additional information contact DEED staff."]
["TAB: Allow SF"]
[0,"The \"Allow SF\" tab is used to document the existing gross square footage (GSF) associated with the school or the school type in an attendance area as denoted in the DEED School Facility Database: https://education.alaska.gov/facilities/SchoolFacilityReport/SearchforSchoolFac.cfm \nIf the district believes there to be an error in the data, please contact Facilities staff. \n\nThe tab compares the eligible GSF, based upon projected ADM, to the existing GSF, and calculates whether additional GSF is allowable.  Available allowances for water treatment/storage and exterior covered spaces are aso provided.\n"]
[1,"Enter the appropriate existing square footage into cell B9 on sheet “Allow SF”.  Square footage will be for the entire attendance area in the School Type identified in cell B5, including support facilities."]
[2,"Enter additional GSF data based on the proposed project: what existing GSF will remain; how much GSF is proposed to be added."]
["TAB: Current Capacity"]
[0,"The \"Current Capacity\" tab compares the existing DEED-designated GSF from \"Allow SF\" tab to the current ADM. "]
[1,"Run the macro \"Module2.ELEM\", or press the \"Calculate Capacity\" button, to see capacity and percentages.  If any numbers change in the \"ADM\" or \"Allow SF\" tabs, this macro must be re-run."]
["TAB: Projected Capacity"]
[0,"The \"Projected Capacity\" tab compares the existing DEED-designated GSF from \"Allow SF\" tab to the projected ADM. "]
[1,"Run the macro \"Module2.ELEM\", or press the \"Calculate Capacity\" button, to see capacity and percentages.  If any numbers change in the \"ADM\" or \"Allow SF\" tabs, this macro must be re-run."]
["TAB: Current ADM"]
[0,"The \"Current ADM\" tab provides ADM data by school, and lists each school's attendance area.  This information may be used for manually updating the \"ADM\" cells B13 and/or B14 for attendance areas with more than one school in a school type."]
{"$rows_left_out":4}
{"sheet":"ADM","index":1,"n_rows":481,"n_cols":18,"rows_kept":481,"cut":false,"hidden":false,"merged":[[6,1,6,9],[1,1,1,9],[2,1,2,9],[3,1,3,9],[4,1,4,9],[5,1,5,9]]}
["ADM Projection Comparison\nTo start: select School in cell B4, then select School Enrollment Type in B6 \nDistrict can provide alternative ADM projections in B13 to J14"]
["ADM Year:",2025]
["School District:",{"$f":"VLOOKUP(NAME,'Current ADM'!$B$3:$L$574,11,FALSE)","v":{"$error":"#N/A"}}]
["School Name:"]
["Project Number:","27-xxx"]
["School Type:","K-12"]
["Attendance Area:",{"$f":"VLOOKUP(NAME,'Current ADM'!$B$3:$F$574,5,FALSE)","v":{"$error":"#N/A"}}]
["Historical Attendance Area ADM by Fiscal Year"]
["Fiscal Year",{"$f":"B2-8","v":2017},{"$f":"B9+1","v":2018},{"$f":"C9+1","v":2019},2020,2021,2022,2023,2024,{"$f":"I9+1","v":2025},"Average \nAnnual ADM \nChange","Overall \nADM \nGrowth"]
["Attendance Area Total ADM",{"$f":"IF($B$7=\"community\",\" \",VLOOKUP($B$7,'Historical ADM by Area'!$C$3:$AS$366,28,FALSE))","v":{"$error":"#N/A"}},{"$f":"IF($B$7=\"community\",\" \",VLOOKUP($B$7,'Historical ADM by Area'!$C$3:$AS$366,29,FALSE))","v":{"$error":"#N/A"}},{"$f":"IF($B$7=\"community\",\" \",VLOOKUP($B$7,'Historical ADM by Area'!$C$3:$AS$366,30,FALSE))","v":{"$error":"#N/A"}},{"$f":"IF($B$7=\"community\",\" \",VLOOKUP($B$7,'Historical ADM by Area'!$C$3:$AS$366,31,FALSE))","v":{"$error":"#N/A"}},{"$f":"IF($B$7=\"community\",\" \",VLOOKUP($B$7,'Historical ADM by Area'!$C$3:$AS$366,32,FALSE))","v":{"$error":"#N/A"}},{"$f":"IF($B$7=\"community\",\" \",VLOOKUP($B$7,'Historical ADM by Area'!$C$3:$AS$366,33,FALSE))","v":{"$error":"#N/A"}},{"$f":"IF($B$7=\"community\",\" \",VLOOKUP($B$7,'Historical ADM by Area'!$C$3:$AS$366,34,FALSE))","v":{"$error":"#N/A"}},{"$f":"IF($B$7=\"community\",\" \",VLOOKUP($B$7,'Historical ADM by Area'!$C$3:$AS$366,35,FALSE))","v":{"$error":"#N/A"}},{"$f":"IF($B$7=\"community\",\" \",VLOOKUP($B$7,'Historical ADM by Area'!$C$3:$AS$366,36,FALSE))","v":{"$error":"#N/A"}},{"$f":"IF(B7=\"community\",\" \",(((C10-B10)/B10+(D10-C10)/C10+(E10-D10)/D10+(F10-E10)/E10+(G10-F10)/F10+(H10-G10)/G10+(I10-H10)/H10+(J10-I10)/I10))/8)","v":{"$error":"#N/A"}},{"$f":"IF(B7=\"community\",\" \",(J10-B10)/B10)","v":{"$error":"#N/A"}}]
["Future School ADM Projections by School Year"]
["Projection Type","Current School Year ADM",{"$f":"VLOOKUP(J9,$O$23:$P$116,2)","v":"2025-2026"},{"$f":"VLOOKUP(J9+1,$O$23:$P$116,2)","v":"2026-2027"},{"$f":"VLOOKUP(J9+2,$O$23:$P$116,2)","v":"2027-2028"},{"$f":"VLOOKUP(J9+3,$O$23:$P$116,2)","v":"2028-2029"},{"$f":"VLOOKUP(J9+4,$O$23:$P$116,2)","v":"2029-2030"},{"$f":"VLOOKUP(J9+5,$O$23:$P$116,2)","v":"2030-2031"},{"$f":"VLOOKUP(J9+6,$O$23:$P$116,2)","v":"2031-2032"},{"$f":"VLOOKUP(J9+7,$O$23:$P$116,2)","v":"2032-2033"},"Average \nAnnual ADM \nChange","Overall \nADM \nGrowth"]
["District's K-6 Projection",{"$f":"ELEM","v":{"$error":"#N/A"}},{"$f":"IF(FCrate>0,ELEM+(ELEM*FCrate),ELEM)","v":{"$error":"#N/A"}},{"$f":"IF(FCrate>0,C13+C13*FCrate,C13)","v":{"$error":"#N/A"}},{"$f":"IF(FCrate>0,D13+D13*FCrate,D13)","v":{"$error":"#N/A"}},{"$error":"#N/A"},{"$f":"IF(FCrate>0,F13+F13*FCrate,F13)","v":{"$error":"#N/A"}},{"$error":"#N/A"},{"$error":"#N/A"},{"$f":"IF(FCrate>0,I13+I13*FCrate,I13)","v":{"$error":"#N/A"}},{"$f":"IF(ELEM=0, \" \",(((C13-ELEM)/ELEM+(D13-C13)/C13+(E13-D13)/D13+(F13-E13)/E13+(G13-F13)/F13+(H13-G13)/G13+(I13-H13)/H13+(J13-I13)/I13))/8)","v":{"$error":"#N/A"}},{"$f":"IF(ELEM=0, \" \", (J13-ELEM)/ELEM)","v":{"$error":"#N/A"}}]
["District's 7-12 Projection",{"$f":"SEC","v":{"$error":"#N/A"}},{"$f":"IF(FCrate>0,SEC+(SEC*FCrate),SEC)","v":{"$error":"#N/A"}},{"$error":"#N/A"},{"$error":"#N/A"},{"$error":"#N/A"},{"$error":"#N/A"},{"$error":"#N/A"},{"$error":"#N/A"},{"$error":"#N/A"},{"$f":"IF(SEC=0, \" \",(((C14-SEC)/SEC+(D14-C14)/C14+(E14-D14)/D14+(F14-E14)/E14+(G14-F14)/F14+(H14-G14)/G14+(I14-H14)/H14+(J14-I14)/I14))/8)","v":{"$error":"#N/A"}},{"$f":"IF(SEC=0, \" \",(J14-SEC)/SEC)","v":{"$error":"#N/A"}}]
["DEED's K-6 Projection",{"$f":"VLOOKUP(NAME,'Current ADM'!$B$3:$F$574,2,FALSE)","v":{"$error":"#N/A"}},{"$f":"IF(ELEM=0, \" \", ELEM*(1+doek6))","v":{"$error":"#N/A"}},{"$f":"IF(ELEM=0, \" \", C15*(1+doek6))","v":{"$error":"#N/A"}},{"$error":"#N/A"},{"$f":"IF(ELEM=0, \" \", E15*(1+doek6))","v":{"$error":"#N/A"}},{"$error":"#N/A"},{"$error":"#N/A"},{"$error":"#N/A"},{"$error":"#N/A"},{"$f":"IF(ELEM=0, \" \", IF(_sdk6>=FCrate, IF(AVERAGE(_sdk6,FCrate)<0,0,AVERAGE(_sdk6,FCrate)), IF(FCrate<0, 0, _sdk6)))","v":{"$error":"#N/A"}},{"$f":"IF(ELEM=0, \" \", (J15-ELEM)/ELEM)","v":{"$error":"#N/A"}}]
["DEED's 7-12 Projection ",{"$f":"VLOOKUP(NAME,'Current ADM'!$B$3:$F$574,3,FALSE)","v":{"$error":"#N/A"}},{"$f":"IF(SEC=0,\" \", SEC*(1+_doe712))","v":{"$error":"#N/A"}},{"$f":"IF(SEC=0,\" \", C16*(1+_doe712))","v":{"$error":"#N/A"}},{"$error":"#N/A"},{"$error":"#N/A"},{"$error":"#N/A"},{"$error":"#N/A"},{"$error":"#N/A"},{"$error":"#N/A"},{"$f":"IF(SEC=0, \" \",IF(_sd712>=FCrate, IF(AVERAGE(_sd712,FCrate)<0,0,AVERAGE(_sd712,FCrate)), IF(FCrate<0, 0, _sd712)))","v":{"$error":"#N/A"}},{"$f":"IF(SEC=0, \" \", (J16-SEC)/SEC)","v":{"$error":"#N/A"}}]
["Note:  If District projection numbers match DEED projection, numbers were not provided by the school district.",null,null,null,null,null,null,null,null,null,null,"end of sheet"]
[]
[]
[]
{"$rows_left_out":462}
{"sheet":"Allow SF","index":2,"n_rows":20,"n_cols":2,"rows_kept":20,"cut":false,"hidden":false,"merged":[[0,0,0,1]]}
["Allowable Gross Square Footage"]
["District:",{"$f":"SD","v":{"$error":"#N/A"}}]
["School:",{"$f":"NAME","v":0}]
["Project Number:",{"$f":"PROJNO","v":"27-xxx"}]
["School Type:",{"$f":"ADM!B6","v":"K-12"}]
["Eligible Gross Square Footage (GSF) Data Type","GSF Values"]
["Projected ADM (K-6):",{"$f":"IF(ABS(_sdk6-FCrate)>0.005,k6ADM,ADM!J13)","v":{"$error":"#N/A"}}]
["Projected ADM (7-12):",{"$f":"IF(ABS(_sd712-FCrate)>0.005,_ADM712,ADM!J14)","v":{"$error":"#N/A"}}]
["Existing DEED designated GSF",0]
["Existing GSF To Remain:",0]
["Additional GSF Requested: ",0]
["Total GSF Proposed:",{"$f":"B10+B11","v":0}]
["Eligible Base GSF:",{"$f":"IF(ADM!$B$6=\"Elementary\",114*B7,IF(ADM!$B$6=\"Secondary\",B8*165,IF(ADM!$B$6=\"K-12\",B7*114+B8*165,IF(ADM!$B$6=\"Mixed Grade\",B7*114+B8*165,IF(ADM!$B$6=\"Secondary+6\",(B7+B8)*165,\" \")))))","v":{"$error":"#N/A"}}]
["Eligible Supplemental GSF:",{"$f":"IF(ADM!$B$6=\"Elementary\",B7*130*10^(-B7/250),IF(ADM!$B$6=\"Secondary\",B8*300*10^(-B8/300),IF(ADM!$B$6=\"K-12\",(B7+B8)*213*10^(-(B7+B8)/483),IF(ADM!$B$6=\"Mixed Grade\",(B7+B8)*250*10^(-(B7+B8)/250),IF(ADM!$B$6=\"Secondary+6\",(B7+B8)*250*10^(-(B7+B8)/250),\" \")))))","v":{"$error":"#N/A"}}]
["Total GSF Eligible:",{"$f":"IF(B13=\" \",0,B13+B14)","v":{"$error":"#N/A"}}]
["Additional GSF Allowable:",{"$f":"IF((B15-B10)<0,0,(B15-B10))","v":{"$error":"#N/A"}}]
["Additional GSF Reduction:",{"$f":"IF(B16=0,\"Not Eligible for Space\",IF(B16>B11,\"No Reduction\",B16-B11))","v":{"$error":"#N/A"}}]
["4 AAC 31.020(e)(2) Additional GSF Allowances"]
["Allowance for Covered Exterior Areas:",{"$f":"IF(OR(B15<B12,B12=0),(IF((B15*0.15)<3000,3000,(IF((B15*0.15)>9000,9000,B15*0.15)))),(IF((B12*0.15)<3000,3000,(IF((B12*0.15)>9000,9000,B12*0.15)))))","v":{"$error":"#N/A"}}]
["Allowance for Water/Sewer Storage & Treatment: ",{"$f":"IF(B12=0,B15*0.05,IF(B15<B12,B15*0.05,B12*0.05))","v":{"$error":"#N/A"}}]
{"$rows_left_out":1}
{"sheet":"Current Capacity","index":3,"n_rows":16,"n_cols":2,"rows_kept":16,"cut":false,"hidden":false,"merged":[[0,0,0,1]]}
["Current Capacity and Unhoused \nRun Macro Capacity_Calc (shortcut CTRL+e) to calculate current school capacity"]
["District:",{"$f":"'Allow SF'!B2","v":{"$error":"#N/A"}}]
["School:",{"$f":"'Allow SF'!B3","v":0}]
["Project Number:",{"$f":"'Allow SF'!B4","v":"27-xxx"}]
["School Type:",{"$f":"ADM!B6","v":"K-12"}]
["Capacity Data Type","Capacity Values"]
["Current ADM (K-6):",{"$f":"ELEM","v":{"$error":"#N/A"}}]
["Current ADM (7-12):",{"$f":"SEC","v":{"$error":"#N/A"}}]
["Existing GSF:",{"$f":"'Allow SF'!B9","v":0}]
["Existing GSF Elementary Capacity:"]
["Existing GSF Secondary Capacity:",{"$f":"IF(EXSF=0,\" \",IF(TYPE=\"Elementary\",0,IF(TYPE=\"Secondary\",O19,EADM*csadm/ceadm)))","v":" "}]
["Existing Base GSF:",{"$f":"IF($B$5=\"Elementary\",114*B10,IF($B$5=\"Secondary\",B11*165,IF($B$5=\"K-12\",B10*114+B11*165,IF($B$5=\"Mixed Grade\",B10*114+B11*165,IF($B$5=\"Secondary+6\",(B10+B11)*165,\" \")))))","v":{"$error":"#VALUE!"}}]
["Existing Supplemental GSF:",{"$f":"IF($B$5=\"Elementary\",B10*130*10^(-B10/250),IF($B$5=\"Secondary\",B11*300*10^(-B11/300),IF($B$5=\"K-12\",(B10+B11)*213*10^(-(B10+B11)/483),IF($B$5=\"Mixed Grade\",(B10+B11)*250*10^(-(B10+B11)/250),IF($B$5=\"Secondary+6\",(B10+B11)*250*10^(-(B10+B11)/250),\" \")))))","v":{"$error":"#VALUE!"}}]
["Existing GSF Serving Total ADM:",{"$f":"IF(EXSF=0,\" \",B12+B13)","v":" "}]
["Unhoused Students:",{"$f":"IF(EXSF=0,\" \",IF(B5=\"Elementary\",B7-B10,IF(B5=\"Secondary\",B8-B11,(B7+B8)-(B10+B11))))","v":" "}]
["Current Percent Capacity:",{"$f":"IF(EXSF=0,\" \",IF(TYPE=\"Elementary\",ceadm/EADM,IF(TYPE=\"Secondary\",csadm/SADM,(B7+B8)/(EADM+SADM))))","v":" "}]

{"sheet":"Projected Capacity","index":4,"n_rows":16,"n_cols":2,"rows_kept":16,"cut":false,"hidden":false,"merged":[[0,0,0,1]]}
["Projected Capacity and Unhoused\nRun Macro Capacity_Calc (shortcut CTRL+e) to calculate projected school capacity"]
["District:",{"$f":"'Allow SF'!B2","v":{"$error":"#N/A"}}]
["School:",{"$f":"'Allow SF'!B3","v":0}]
["Project Number:",{"$f":"'Allow SF'!B4","v":"27-xxx"}]
["School Type:",{"$f":"ADM!B6","v":"K-12"}]
["Capacity Data Type","Capacity Values"]
["Projected ADM (K-6):",{"$f":"'Allow SF'!B7","v":{"$error":"#N/A"}}]
["Projected ADM (7-12):",{"$f":"'Allow SF'!B8","v":{"$error":"#N/A"}}]
["Existing GSF:",{"$f":"'Allow SF'!B9","v":0}]
["Existing GSF Elementary Capacity:"]
["Existing GSF Secondary Capacity:",{"$f":"IF(EXSF=0,\" \",IF(TYPE=\"Elementary\",0,IF(TYPE=\"Secondary\",O19,EADM*csadm/ceadm)))","v":" "}]
["Existing Base GSF:",{"$f":"IF($B$5=\"Elementary\",114*B10,IF($B$5=\"Secondary\",B11*165,IF($B$5=\"K-12\",B10*114+B11*165,IF($B$5=\"Mixed Grade\",B10*114+B11*165,IF($B$5=\"Secondary+6\",(B10+B11)*165,\" \")))))","v":{"$error":"#VALUE!"}}]
["Existing Supplemental GSF:",{"$f":"IF($B$5=\"Elementary\",B10*130*10^(-B10/250),IF($B$5=\"Secondary\",B11*300*10^(-B11/300),IF($B$5=\"K-12\",(B10+B11)*213*10^(-(B10+B11)/483),IF($B$5=\"Mixed Grade\",(B10+B11)*250*10^(-(B10+B11)/250),IF($B$5=\"Secondary+6\",(B10+B11)*250*10^(-(B10+B11)/250),\" \")))))","v":{"$error":"#VALUE!"}}]
["Existing GSF Serving Total ADM:",{"$f":"IF(EXSF=0,\" \",B12+B13)","v":" "}]
["Unhoused Students:",{"$f":"IF(EXSF=0,\" \",IF(B5=\"Elementary\",B7-B10,IF(B5=\"Secondary\",B8-B11,(B7+B8)-(B10+B11))))","v":" "}]
["Projected Percent Capacity:",{"$f":"IF(EXSF=0,\" \",IF(TYPE=\"Elementary\",ceadm/EADM,IF(TYPE=\"Secondary\",csadm/SADM,(B7+B8)/(EADM+SADM))))","v":" "}]

{"sheet":"Current ADM","index":5,"n_rows":512,"n_cols":12,"rows_kept":512,"cut":false,"hidden":false,"merged":[[0,0,0,4]]}
["Department of Education & Early Development\nPrepared by School Finance 5/8/2025\nFY2025 ADM Report"]
["District","School Name","K-6*","7-12","Total ADM","Attendance Area",null,"Attendance Area","K-6","7-12","Total","District"]
["Alaska Gateway","Dot Lake School",5.25,7,{"$f":"C3+D3","v":12.25},"Dot Lake",null,"Dot Lake",{"$f":"SUMIF($F$3:$F$509,H3,$C$3:$C$509)","v":5.25},{"$f":"SUMIF($F$3:$F$509,H3,$D$3:$D$509)","v":7},{"$f":"SUM(I3:J3)","v":12.25},"Alaska Gateway"]
["Alaska Gateway","Eagle Community School",6,6,{"$f":"C4+D4","v":12},"Eagle",null,"Eagle",6,6,{"$f":"SUM(I4:J4)","v":12},"Alaska Gateway"]
["Alaska Gateway","Mentasta Lake School",13,13.25,26.25,"Mentasta Lake",null,"Mentasta Lake",13,13.25,{"$f":"SUM(I5:J5)","v":26.25},"Alaska Gateway"]
["Alaska Gateway","Tetlin School",13.25,13,26.25,"Tetlin",null,"Tetlin",13.25,13,{"$f":"SUM(I6:J6)","v":26.25},"Alaska Gateway"]
["Alaska Gateway","Tok School",93,79.25,172.25,"Tok",null,"Tok",93,79.25,172.25,"Alaska Gateway"]
["Alaska Gateway","Walter Northway School",27,25,52,"Northway",null,"Northway",27,25,52,"Alaska Gateway"]
["Alaska Gateway","TOTAL",{"$f":"SUM(C3:C8)","v":157.5},{"$f":"SUM(D3:D8)","v":143.5},{"$f":"SUM(E3:E8)","v":301},null,null,null,null,null,{"$f":"SUM(K3:K8)","v":301}]
["Aleutian Region","Nikolski School",8,2,{"$f":"C10+D10","v":10},"Nikolski",null,"Nikolski",{"$f":"SUMIF($F$3:$F$509,H10,$C$3:$C$509)","v":8},{"$f":"SUMIF($F$3:$F$509,H10,$D$3:$D$509)","v":2},10]
["Aleutian Region","Yakov E. Netsvetov School",9,2,{"$f":"C11+D11","v":11},"Atka",null,"Atka",{"$f":"SUMIF($F$3:$F$509,H11,$C$3:$C$509)","v":9},{"$f":"SUMIF($F$3:$F$509,H11,$D$3:$D$509)","v":2},11,"Aleutian Region"]
["Aleutian Region","TOTAL",{"$f":"SUM(C11:C11)","v":9},{"$f":"SUM(D11:D11)","v":2},{"$f":"SUM(E10:E11)","v":21},null,null,null,null,null,{"$f":"SUM(K10:K11)","v":21}]
["Aleutians East","Akutan School",6.05,9,{"$f":"C13+D13","v":15.05},"Akutan",null,"Akutan",{"$f":"SUMIF($F$3:$F$509,H13,$C$3:$C$509)","v":6.05},{"$f":"SUMIF($F$3:$F$509,H13,$D$3:$D$509)","v":9},15.05,"Aleutians East"]
["Aleutians East","False Pass School",7,3,{"$f":"C14+D14","v":10},"False Pass",null,"False Pass",{"$f":"SUMIF($F$3:$F$509,H14,$C$3:$C$509)","v":7},{"$f":"SUMIF($F$3:$F$509,H14,$D$3:$D$509)","v":3},10,"Aleutians East"]
["Aleutians East","King Cove School",29,29,{"$f":"C15+D15","v":58},"King Cove",null,"King Cove",{"$f":"SUMIF($F$3:$F$509,H15,$C$3:$C$509)","v":29},{"$f":"SUMIF($F$3:$F$509,H15,$D$3:$D$509)","v":29},58,"Aleutians East"]
["Aleutians East","Sand Point School",37.1,43,{"$f":"C16+D16","v":80.099999999999994},"Sand Point",null,"Sand Point",{"$f":"SUMIF($F$3:$F$509,H16,$C$3:$C$509)","v":37.1},{"$f":"SUMIF($F$3:$F$509,H16,$D$3:$D$509)","v":43},80.099999999999994,"Aleutians East"]
["Aleutians East","TOTAL",{"$f":"SUM(C13:C16)","v":79.150000000000006},{"$f":"SUM(D13:D16)","v":84},{"$f":"SUM(E13:E16)","v":163.14999999999998},null,null,null,null,null,{"$f":"SUM(K13:K16)","v":163.14999999999998}]
["Anchorage","K-6 Airport Heights Elementary",227.65,null,{"$f":"C18+D18","v":227.65},"Anchorage",null,"JBER",{"$f":"SUMIF($F$3:$F$509,H18,$C$3:$C$509)","v":1039.07},{"$f":"SUMIF($F$3:$F$509,H18,$D$3:$D$509)","v":0},1039.07,"Anchorage"]
["Anchorage","K-6 Alpenglow Elementary",276.10000000000002,null,276.10000000000002,"Anchorage",null,"Girdwood",143.80000000000001,30.75,174.55,"Anchorage"]
["Anchorage","K-6 Aurora Elementary (Mt. Spurr)",318.2,null,318.2,"JBER",null,"Anchorage",19477.430000000004,17354.899999999998,36832.33,"Anchorage"]
{"$rows_left_out":493}
{"sheet":"Historical ADM by Area","index":6,"n_rows":368,"n_cols":40,"rows_kept":368,"cut":false,"hidden":false,"merged":[]}
["ADM by Fiscal Year",null,1,2,3,4,5,6,7,8,9,10,11,12,13,14,15,16,17,18,19,20,21,22,23,24,25,26,27,28,29,30,31,32,33,34,35,36]
["Type","School District","Attendance Area","91 ADM","92 ADM","93 ADM","94 ADM","95 ADM","96 ADM","97 ADM","98 ADM","99 ADM","2000 ADM","2001 ADM","2002 ADM","2003 ADM","2004 ADM","2005 ADM","2006 ADM","2007 ADM","2008 ADM","2009 ADM","2010 ADM","2011 ADM","2012 ADM","2013 ADM","2014 ADM","2015 ADM","2016 ADM","2017 ADM","2018 ADM","2019 ADM","2020 ADM","2021 ADM","2022 ADM","2023 ADM","2024 ADM","2025 ADM","% ADM change from Prev. Yr ","8-Yr Avg Annual ADM Change"]
["REAA","ALASKA GATEWAY","ALCAN BORDER",null,10,7,8,7,9,7,0,"closed","closed","closed","closed","closed","closed","closed","closed","closed","closed","closed","closed","closed","closed","closed","closed","closed","closed","closed","closed","closed","closed","closed","closed","closed","Closed","Closed","n/a",{"$f":"IFERROR(((AG3-AE3)/AE3+(AE3-AD3)/AD3+(AD3-AC3)/AC3+(AC3-AB3)/AB3+(AB3-AA3)/AA3+(AA3-Z3)/Z3+(Z3-Y3)/Y3+(Y3-X3)/X3)/8,\"n/a\")","v":"n/a"}]
["REAA","ALASKA GATEWAY","DOT LAKE",18,16.05,20,21.3,24,26.7,27.75,15,17.649999999999999,10.5,13.15,17.059999999999999,15.25,17.3,16.5,12.05,20.25,10.5,10.9,15.75,13.75,10,10,10,11,14,12.7,10,10.8,10,14.25,8,14,10,12.25,{"$f":"IFERROR((AL4-AK4)/AK4,\"n/a\")","v":0.22500000000000001},{"$f":"IFERROR(((AL4-AK4)/AK4+(AK4-AJ4)/AJ4+(AJ4-AI4)/AI4+(AI4-AH4)/AH4+(AH4-AG4)/AG4+(AG4-AF4)/AF4+(AF4-AE4)/AE4+(AE4-AD4)/AD4)/8,\"n/a\")","v":5.8627090473339957E-2}]
["REAA","ALASKA GATEWAY","EAGLE",39,31.25,26,37,23.9,19,27,23,24.3,32.5,22.25,22.55,18.850000000000001,24.4,26,22,22.7,24.5,16.16,25.8,12.05,15.25,16,26,16.75,13.5,14.25,26.1,22.85,14.4,20,12,10.55,10,12,{"$f":"IFERROR((AL5-AK5)/AK5,\"n/a\")","v":0.2},{"$f":"IFERROR(((AL5-AK5)/AK5+(AK5-AJ5)/AJ5+(AJ5-AI5)/AI5+(AI5-AH5)/AH5+(AH5-AG5)/AG5+(AG5-AF5)/AF5+(AF5-AE5)/AE5+(AE5-AD5)/AD5)/8,\"n/a\")","v":4.4147208155988805E-2}]
["REAA","ALASKA GATEWAY","MENTASTA LAKE",21,19.399999999999999,33.950000000000003,33.5,25.35,33.299999999999997,43,39.9,45.5,30.7,33.450000000000003,37.5,37.75,34,31,24.25,19,11.89,13.75,13.25,34.4,34,32,33.15,30.25,31.25,34.75,31.25,31,29.9,28.5,30,33,29,26.25,-9.4827586206896547E-2,-3.1804270796842414E-2]
["REAA","ALASKA GATEWAY","NORTHWAY",99,85.45,79.599999999999994,87,83.3,85.25,85.4,92,84.5,76.3,74,66.900000000000006,65.099999999999994,65.7,67.3,57.6,56,46.5,48.5,44,41.9,41.9,41.15,45.3,42.25,47.85,48.3,47,53.5,49,52.9,51.85,57,55,52,-5.4545454545454543E-2,1.2088184556566118E-2]
["REAA","ALASKA GATEWAY","TANACROSS",19,17,11.25,20.2,16.25,14.8,17,20,15,22.35,16,12.5,10.25,12.9,11,13.45,24,26,10.75,12.15,10.35,13.65,11.45,12.35,12.05,10.8,12,11.8,15.25,12.45,14.25,11,10,5.75,"Closed","n/a","n/a"]
["REAA","ALASKA GATEWAY","TETLIN",23,25.5,34.1,34,30.95,31,36.4,33,31,32,27,26.15,27,33.200000000000003,27.2,31.25,25.8,24.25,27,16.600000000000001,26,29,27.55,35.6,27.15,26.25,27.9,23,33.5,38,39,44.2,37,34,26.25,-0.22794117647058823,1.2869224356194881E-2]
["REAA","ALASKA GATEWAY","TOK",264,290.8,300.14999999999998,284.55,325.39999999999998,316.8,329.1,291.45,249.99,231.9,250.45,265.35000000000002,255.4,251.21,224.25,199.1,206.35,193.85,200.06,197,196.85,178.4,167.55,150.15,165.25,161.25,162.05000000000001,197.4,173.45,175.2,164,167.45,178.60000000000002,163.80000000000001,172.25,5.1587301587301515E-2,1.2415237889895424E-2]
["REAA","ALASKA GATEWAY","TOTAL",{"$f":"SUM(D3:D10)","v":483},495.45,512.04999999999995,525.54999999999995,536.15,535.85,572.65000000000009,514.35,467.94,436.25,436.29999999999995,448.01,429.6,438.71000000000004,403.25,359.7,374.1,{"$f":"SUM(U3:U10)","v":337.49},{"$f":"SUM(V3:V10)","v":327.12},324.55,335.29999999999995,322.20000000000005,305.70000000000005,312.55,304.7,304.89999999999998,311.95000000000005,346.54999999999995,{"$f":"SUM(AF3:AF10)","v":340.35},328.95,332.9,324.5,340.15000000000003,307.55,301,-2.1297350024386315E-2,-2.8255791667122273E-3]
["REAA","ALEUTIAN REGION","ATKA",26,19,18,16,18,21,23,24.45,13,20,19.25,21,19,16.100000000000001,17.75,15,13,13,14,15,10,10,10.3,14,12,14,10,12,6,10,10,10,11.25,11,11,0,5.8680555555555548E-2]
["REAA","ALEUTIAN REGION","NIKOLSKI",7,9,5,null,null,null,11,12,19,11,15,10.75,13.5,11,10,10,10,10.45,9.8000000000000007,"closed","closed","closed","closed","closed","closed","closed","closed","closed","closed","closed","closed","closed","closed","Closed",10,"n/a","n/a"]
["REAA","ALEUTIAN REGION","ADAK",712,714.45,681.35,495.2,0,0,0,0,14.7,44.15,25.15,23,16.75,14.75,18.25,19,19,14,13.2,22,20.65,21,15,19,25,20.7,14.5,14.55,12.05,18,14.95,12.48,5,"closed","closed","n/a","n/a"]
["REAA","ALEUTIAN REGION","TOTAL",{"$f":"SUM(D12:D14)","v":745},742.45,704.35,511.2,18,21,34,36.450000000000003,46.7,75.150000000000006,59.4,54.75,49.25,41.85,46,44,42,{"$f":"SUM(U12:U14)","v":37.450000000000003},{"$f":"SUM(V12:V14)","v":37},37,30.65,31,25.3,33,37,34.700000000000003,24.5,26.55,{"$f":"SUM(AF12:AF14)","v":18.05},28,24.95,22.48,16.25,11,21,0.90909090909090906,5.1965191865858934E-2]
["C/B","ALEUTIAN EAST","AKUTAN",21.55,25,30,20,24,20,27,23,19.55,15,15,15.75,17.75,12.5,14.35,10.75,10.75,13.75,7,10.25,8,8,14,13,17,16,10,12,18,20,17,19.5,20,23.35,15.05,-0.35546038543897218,8.0731321855322058E-2]
["C/B","ALEUTIAN EAST","COLD BAY",25,18,24,17,22,22,18,20,14.3,17,23,10.5,12,15,13.75,10,10,10.5,12,11.25,13,10,8.5,11,4.75,"closed","closed","closed","closed","closed","closed","closed","closed","closed","closed","n/a","n/a"]
["C/B","ALEUTIAN EAST","FALSE PASS",16,20,17,21,27,25,21,11.4,7.2,16,14.5,16,12.4,12,10.7,11,4.75,5.3,11,4.75,7.5,7,10,6,15,10.5,11,6,7,6,10,11,9,6,10,0.66666666666666663,6.0930735930735912E-2]
["C/B","ALEUTIAN EAST","KING COVE",147.65,150,165,159,154,139,143,142.35,128.80000000000001,111.9,123.75,119,105.6,104.66,102.25,92.8,89.8,99.5,101.25,97.35,99.35,89.75,96.5,87,77.650000000000006,93.65,84.1,83,83.45,82.65,75.25,68.05,77,73.650000000000006,58,-0.21249151391717588,-4.0867108680707975E-2]
["C/B","ALEUTIAN EAST","NELSON LAGOON",12,12,12,11,10,13,13,14.2,14,15,16,16,11,13,15,17.75,17,17,12,8,6.25,10.9,"closed","closed","closed","closed","closed","closed","closed","closed","closed","closed","closed","closed","closed","n/a","n/a"]
{"$rows_left_out":348}